Reaction Details
TargetGenome polyprotein
LigandBDBM50055229
Substrate/Competitorn/a
Meas. Tech.ChEMBL_393 (CHEMBL615643)
Ki 25±n/a nM
Citation Webber, SETikhe, JWorland, STFuhrman, SAHendrickson, TFMatthews, DALove, RAPatick, AKMeador, JWFerre, RABrown, ELDeLisle, DMFord, CEBinford, SL Design, synthesis, and evaluation of nonpeptidic inhibitors of human rhinovirus 3C protease. J Med Chem39:5072-82 (1997) 
 
Genome polyprotein
Name:Genome polyprotein
Type:PROTEIN
Mol. Mass.:44361.04
Organism:Human rhinovirus B
Description:ChEMBL_158953
Residue:401
BDBM50055229
NameBDBM50055229
Synonyms:1-(3,5-Dimethoxy-benzyl)-2,3-dioxo-2,3-dihydro-1H-indole-5-carboxylic acid amide | CHEMBL358951
TypeSmall organic molecule
Emp. Form.C18H16N2O5
Mol. Mass.340.33
SMILESCOc1cc(CN2C(=O)C(=O)c3cc(ccc23)C(N)=O)cc(OC)c1