Reaction Details
TargetGenome polyprotein
LigandBDBM50055234
Substrate/Competitorn/a
Meas. Tech.ChEMBL_393 (CHEMBL615643)
Ki 3±n/a nM
Citation Webber, SETikhe, JWorland, STFuhrman, SAHendrickson, TFMatthews, DALove, RAPatick, AKMeador, JWFerre, RABrown, ELDeLisle, DMFord, CEBinford, SL Design, synthesis, and evaluation of nonpeptidic inhibitors of human rhinovirus 3C protease. J Med Chem39:5072-82 (1997) 
 
Genome polyprotein
Name:Genome polyprotein
Type:PROTEIN
Mol. Mass.:44361.04
Organism:Human rhinovirus B
Description:ChEMBL_158953
Residue:401
BDBM50055234
NameBDBM50055234
Synonyms:1-(6-Methoxy-naphthalen-2-ylmethyl)-2,3-dioxo-2,3-dihydro-1H-indole-5-carboxylic acid amide | CHEMBL145830
TypeSmall organic molecule
Emp. Form.C21H16N2O4
Mol. Mass.360.3627
SMILESCOc1ccc2cc(CN3C(=O)C(=O)c4cc(ccc34)C(N)=O)ccc2c1