Reaction Details
TargetGenome polyprotein
LigandBDBM50055232
Substrate/Competitorn/a
Meas. Tech.ChEMBL_393 (CHEMBL615643)
Ki 4±n/a nM
Citation Webber, SETikhe, JWorland, STFuhrman, SAHendrickson, TFMatthews, DALove, RAPatick, AKMeador, JWFerre, RABrown, ELDeLisle, DMFord, CEBinford, SL Design, synthesis, and evaluation of nonpeptidic inhibitors of human rhinovirus 3C protease. J Med Chem39:5072-82 (1997) 
 
Genome polyprotein
Name:Genome polyprotein
Type:PROTEIN
Mol. Mass.:44361.04
Organism:Human rhinovirus B
Description:ChEMBL_158953
Residue:401
BDBM50055232
NameBDBM50055232
Synonyms:1-(6-Hydroxy-naphthalen-2-ylmethyl)-2,3-dioxo-2,3-dihydro-1H-indole-5-carboxylic acid amide | CHEMBL148199
TypeSmall organic molecule
Emp. Form.C20H14N2O4
Mol. Mass.346.3362
SMILESNC(=O)c1ccc2N(Cc3ccc4cc(O)ccc4c3)C(=O)C(=O)c2c1