Reaction Details
TargetGenome polyprotein
LigandBDBM50055225
Substrate/Competitorn/a
Meas. Tech.ChEMBL_393 (CHEMBL615643)
Ki 10±n/a nM
Citation Webber, SETikhe, JWorland, STFuhrman, SAHendrickson, TFMatthews, DALove, RAPatick, AKMeador, JWFerre, RABrown, ELDeLisle, DMFord, CEBinford, SL Design, synthesis, and evaluation of nonpeptidic inhibitors of human rhinovirus 3C protease. J Med Chem39:5072-82 (1997) 
 
Genome polyprotein
Name:Genome polyprotein
Type:PROTEIN
Mol. Mass.:44361.04
Organism:Human rhinovirus B
Description:ChEMBL_158953
Residue:401
BDBM50055225
NameBDBM50055225
Synonyms:1-(4-Methyl-benzyl)-2,3-dioxo-2,3-dihydro-1H-indole-5-carboxylic acid amide | CHEMBL148689
TypeSmall organic molecule
Emp. Form.C17H14N2O3
Mol. Mass.294.3047
SMILESCc1ccc(CN2C(=O)C(=O)c3cc(ccc23)C(N)=O)cc1