Reaction Details
TargetNitric oxide synthase, inducible
LigandBDBM50055282
Substrate/Competitorn/a
Meas. Tech.ChEMBL_89201 (CHEMBL701152)
IC50 3000±n/a nM
Citation Zhang, JMcCarthy, TJMoore, WMCurrie, MGWelch, MJ Synthesis and evaluation of two positron-labeled nitric oxide synthase inhibitors, S-[11C]methylisothiourea and S-(2-[18F]fluoroethyl)isothiourea, as potential positron emission tomography tracers. J Med Chem39:5110-8 (1997) 
 
Nitric oxide synthase, inducible
Name:Nitric oxide synthase, inducible
Type:Homodimer
Mol. Mass.:131141.95
Organism:Homo sapiens (Human)
Description:P35228
Residue:1153
BDBM50055282
NameBDBM50055282
Synonyms:2-Methyl-isothiourea | CHEMBL356703
TypeSmall organic molecule
Emp. Form.C2H6N2S
Mol. Mass.90.147
SMILESCSC(N)=N