Reaction Details
TargetNitric oxide synthase, inducible
LigandBDBM50055281
Substrate/Competitorn/a
Meas. Tech.ChEMBL_89363 (CHEMBL699693)
Ki 5.2±n/a nM
Citation Zhang, JMcCarthy, TJMoore, WMCurrie, MGWelch, MJ Synthesis and evaluation of two positron-labeled nitric oxide synthase inhibitors, S-[11C]methylisothiourea and S-(2-[18F]fluoroethyl)isothiourea, as potential positron emission tomography tracers. J Med Chem39:5110-8 (1997) 
 
Nitric oxide synthase, inducible
Name:Nitric oxide synthase, inducible
Type:Enzyme
Mol. Mass.:130595.79
Organism:Mus musculus (mouse)
Description:Recombinant enzyme overexpressed in E. coli.
Residue:1144
BDBM50055281
NameBDBM50055281
Synonyms:2-Ethyl-isothiourea ETHYLISOTHIOUREA S-ethyl-iso-thiourea
TypeSmall organic molecule
Emp. Form.C3H8N2S
Mol. Mass.104.174
SMILESCCSC(N)=N