Reaction Details
TargetProtein kinase C delta type
LigandBDBM50055666
Substrate/Competitorn/a
Meas. Tech.ChEMBL_160768 (CHEMBL766309)
IC50 20±n/a nM
Citation Lai, YSMendoza, JSJagdmann, GEMenaldino, DSBiggers, CKHeerding, JMWilson, JWHall, SEJiang, JBJanzen, WPBallas, LM Synthesis and protein kinase C inhibitory activities of balanol analogs with replacement of the perhydroazepine moiety. J Med Chem40:226-35 (1997) 
 
Protein kinase C delta type
Name:Protein kinase C delta type
Type:Enzyme
Mol. Mass.:77516.79
Organism:Homo sapiens (Human)
Description:The recombinant human PKC enzymes were produced using a baculovirus expression system in SF9 cells
Residue:676
BDBM50055666
NameBDBM50055666
Synonyms:4-(2-Carboxy-6-hydroxy-benzoyl)-3,5-dihydroxy-benzoic acid (2R,3R)-3-(4-hydroxy-benzoylamino)-bicyclo[2.2.1]hept-2-yl ester | CHEMBL80525
TypeSmall organic molecule
Emp. Form.C29H25NO10
Mol. Mass.547.5095
SMILESOC(=O)c1cccc(O)c1C(=O)c1c(O)cc(cc1O)C(=O)O[C@@H]1C2CCC(C2)[C@H]1NC(=O)c1ccc(O)cc1