Reaction Details
TargetProtein kinase C gamma type
LigandBDBM50055670
Substrate/Competitorn/a
Meas. Tech.ChEMBL_161269 (CHEMBL767890)
IC50 140±n/a nM
Citation Lai, YSMendoza, JSJagdmann, GEMenaldino, DSBiggers, CKHeerding, JMWilson, JWHall, SEJiang, JBJanzen, WPBallas, LM Synthesis and protein kinase C inhibitory activities of balanol analogs with replacement of the perhydroazepine moiety. J Med Chem40:226-35 (1997) 
 
Protein kinase C gamma type
Name:Protein kinase C gamma type
Type:Enzyme
Mol. Mass.:78458.05
Organism:Homo sapiens (Human)
Description:The recombinant human PKC enzymes were produced using a baculovirus expression system in SF9 cells
Residue:697
BDBM50055670
NameBDBM50055670
Synonyms:4-(2-Carboxy-6-hydroxy-benzoyl)-3,5-dihydroxy-benzoic acid (3R,4R)-3-(4-hydroxy-benzoylamino)-1-aza-bicyclo[3.2.2]non-4-yl ester | CHEMBL78129
TypeSmall organic molecule
Emp. Form.C30H28N2O10
Mol. Mass.576.5507
SMILESOC(=O)c1cccc(O)c1C(=O)c1c(O)cc(cc1O)C(=O)O[C@@H]1C2CCN(CC2)C[C@H]1NC(=O)c1ccc(O)cc1