Reaction Details
TargetEndothelin receptor type B
LigandBDBM50056081
Substrate/Competitorn/a
Meas. Tech.ChEMBL_63873 (CHEMBL671335)
IC50 960.0±n/a nM
Citation Tasker, ASSorensen, BKJae, HSWinn, Mvon Geldern, TWDixon, DBChiou, WJDayton, BDCalzadila, SHernandez, LMarsh, KCWuWong, JROpgenorth, TJ Potent and selective non-benzodioxole-containing endothelin-A receptor antagonists. J Med Chem40:322-30 (1997) 
 
Endothelin receptor type B
Name:Endothelin receptor type B
Type:PROTEIN
Mol. Mass.:49616.89
Organism:Sus scrofa
Description:ChEMBL_63872
Residue:443
BDBM50056081
NameBDBM50056081
Synonyms:(2R,3R,4S)-1-Dibutylcarbamoylmethyl-4-(2,3-dihydro-benzofuran-6-yl)-2-(4-methoxy-phenyl)-pyrrolidine-3-carboxylic acid CHEMBL326191
TypeSmall organic molecule
Emp. Form.C30H40N2O5
Mol. Mass.508.649
SMILESCCCCN(CCCC)C(=O)CN1C[C@@H]([C@H]([C@@H]1c1ccc(OC)cc1)C(O)=O)c1ccc2CCOc2c1