Reaction Details
TargetL-selectin
LigandBDBM50056133
Substrate/Competitorn/a
Meas. Tech.ChEMBL_199998 (CHEMBL873251)
IC50>1000000±n/a nM
Citation Tsujishita, HHiramatsu, YKondo, NOhmoto, HKondo, HKiso, MHasegawa, A Selectin-ligand interactions revealed by molecular dynamics simulation in solution. J Med Chem40:362-9 (1997) 
 
L-selectin
Name:L-selectin
Type:PROTEIN
Mol. Mass.:42187.20
Organism:Homo sapiens (Human)
Description:ChEMBL_200000
Residue:372
BDBM50056133
NameBDBM50056133
Synonyms:5-Acetylamino-2-(3,5-dihydroxy-2-hydroxymethyl-6-N-[2,5-Dihydroxy-6-hydroxymethyl-4-(3,4,5-trihydroxy-6-methyl-tetrahydro-pyran-2-yloxy)-tetrahydro-pyran-3-yl]-acetamide-tetrahydro-pyran-4-yloxy)-4-hydroxy-6-(1,2,3-trihydroxy-propyl)-tetrahydro-pyran-2-carboxylic acid | CHEMBL407480
TypeSmall organic molecule
Emp. Form.C31H52N2O23
Mol. Mass.820.7442
SMILESCC1OC(OC2C(NC(C)=O)[C@@H](O)OC(CO)C2OC2OC(CO)C(O)C(OC3(CC(O)C(NC(C)=O)C(O3)[C@H](O)[C@H](O)CO)C(O)=O)C2O)C(O)C(O)C1O