Reaction Details
TargetL-selectin
LigandBDBM50056132
Substrate/Competitorn/a
Meas. Tech.ChEMBL_199998 (CHEMBL873251)
IC50>1000000±n/a nM
Citation Tsujishita, HHiramatsu, YKondo, NOhmoto, HKondo, HKiso, MHasegawa, A Selectin-ligand interactions revealed by molecular dynamics simulation in solution. J Med Chem40:362-9 (1997) 
 
L-selectin
Name:L-selectin
Type:PROTEIN
Mol. Mass.:42187.20
Organism:Homo sapiens (Human)
Description:ChEMBL_200000
Residue:372
BDBM50056132
NameBDBM50056132
Synonyms:2-[5,6-dihydroxy-2-hydroxymethyl-4-(3,4,5-trihydroxy-6-methyltetrahydro-2H-2-pyranyloxy)tetrahydro-2H-3-pyranyloxy]-6-hydroxymethyltetrahydro-2H-3,4,5-pyrantriol sodium sulphonate | CHEMBL333353
TypeSmall organic molecule
Emp. Form.C18H31O18S
Mol. Mass.567.493
SMILESCC1OC(OC2C(O)C(O)OC(CO)C2OC2OC(CO)C(O)C(OS([O-])(=O)=O)C2O)C(O)C(O)C1O