Reaction Details
TargetP-selectin
LigandBDBM50408284
Substrate/Competitorn/a
Meas. Tech.ChEMBL_200028 (CHEMBL810717)
IC50 100000±n/a nM
Citation Tsujishita, HHiramatsu, YKondo, NOhmoto, HKondo, HKiso, MHasegawa, A Selectin-ligand interactions revealed by molecular dynamics simulation in solution. J Med Chem40:362-9 (1997) 
 
P-selectin
Name:P-selectin
Type:PROTEIN
Mol. Mass.:90834.61
Organism:Homo sapiens (Human)
Description:ChEMBL_1438999
Residue:830
BDBM50408284
NameBDBM50408284
Synonyms:CHEMBL2029056
TypeSmall organic molecule
Emp. Form.C48H91O18S
Mol. Mass.988.291
(CCCCCCCCCCCCCC)CO[C@@H]1O[C@H](CO)[C@@H](O[C@@H]2O[C@H](CO)[C@H](O)[C@H](OS([O-])(=O)=O)[C@H]2O)[C@H](O[C@@H]2O[C@@H](C)[C@@H](O)[C@@H](O)[C@@H]2O)[C@H]1O