Reaction Details
TargetPotassium-transporting ATPase alpha chain 1/subunit beta
LigandBDBM50008978
Substrate/Competitorn/a
Meas. Tech.ChEMBL_76085 (CHEMBL686819)
IC50 64±n/a nM
Citation Kaminski, JJDoweyko, AM Antiulcer agents. 6. Analysis of the in vitro biochemical and in vivo gastric antisecretory activity of substituted imidazo[1,2-a]pyridines and related analogues using comparative molecular field analysis and hypothetical active site lattice methodologies. J Med Chem40:427-36 (1997) 
 
Potassium-transporting ATPase alpha chain 1/subunit beta
Name:Potassium-transporting ATPase alpha chain 1/subunit beta
Type:n/a
Mol. Mass.:n/a
Description:ASSAY_ID of EBI is 71495
Components:This complex has 2 components.
Component 1
Name:Potassium-transporting ATPase alpha chain 1
Synonyms:ATP4A Gastric H(+)/K(+) ATPase subunit alpha Potassium-transporting ATPase alpha chain 1 | Proton pump
Type:PROTEIN
Mol. Mass.:114109.05
Organism:Homo sapiens (Human)
Description:EBI_82
Residue:1035
Component 2
Name:Potassium-transporting ATPase subunit beta
Synonyms:ATP4B Gastric H(+)/K(+) ATPase subunit beta Potassium-transporting ATPase subunit beta | Proton pump beta chain
Type:PROTEIN
Mol. Mass.:33369.83
Organism:Homo sapiens (Human)
Description:EBI_10719
Residue:291
BDBM50008978
NameBDBM50008978
Synonyms:(+/-)-(2-Methyl-8-phenyl-7,8-dihydro-6H-9-oxa-1,3a-diaza-cyclopenta[a]naphthalen-3-yl)-acetonitrile 7H-8,9-dihydropyrano[2,3c]imidazo[1,2-a]pyridine | CHEMBL296482
TypeSmall organic molecule
Emp. Form.C19H17N3O
Mol. Mass.303.3578
SMILESCc1nc2c3OC(CCc3ccn2c1CC#N)c1ccccc1