Reaction Details
TargetThermolysin
LigandBDBM50056248
Substrate/Competitorn/a
Meas. Tech.ChEMBL_210396 (CHEMBL814126)
IC50 1800±n/a nM
Citation Ksander, GMde Jesus, RYuan, AGhai, RDTrapani, AMcMartin, CBohacek, R Ortho-substituted benzofused macrocyclic lactams as zinc metalloprotease inhibitors. J Med Chem40:495-505 (1997) 
 
Thermolysin
Name:Thermolysin
Type:PROTEIN
Mol. Mass.:60097.54
Organism:Bacillus thermoproteolyticus
Description:ChEMBL_1468794
Residue:548
BDBM50056248
NameBDBM50056248
Synonyms:(6R,9S)-6-Mercaptomethyl-7-oxo-6,7,8,9,10,11,12,13,14,15-decahydro-5H-8-aza-benzocyclotridecene-9-carboxylic acid | CHEMBL146573
TypeSmall organic molecule
Emp. Form.C18H25NO3S
Mol. Mass.335.461
SMILESOC(=O)[C@@H]1CCCCCCc2ccccc2C[C@@H](CS)C(=O)N1