Reaction Details
TargetNeprilysin
LigandBDBM50056256
Substrate/Competitorn/a
Meas. Tech.ChEMBL_144635 (CHEMBL752993)
IC50 136±n/a nM
Citation Ksander, GMde Jesus, RYuan, AGhai, RDTrapani, AMcMartin, CBohacek, R Ortho-substituted benzofused macrocyclic lactams as zinc metalloprotease inhibitors. J Med Chem40:495-505 (1997) 
 
Neprilysin
Name:Neprilysin
Type:Enzyme
Mol. Mass.:85505.38
Organism:Homo sapiens (Human)
Description:P08473
Residue:750
BDBM50056256
NameBDBM50056256
Synonyms:(6R,9S)-9-Mercaptomethyl-8-oxo-6,7,8,9,10,11,12,13,14,15-decahydro-5H-7-aza-benzocyclotridecene-6-carboxylic acid | CHEMBL149367
TypeSmall organic molecule
Emp. Form.C18H25NO3S
Mol. Mass.335.461
SMILESOC(=O)[C@H]1Cc2ccccc2CCCCCC[C@H](CS)C(=O)N1