Reaction Details
TargetThermolysin
LigandBDBM50056258
Substrate/Competitorn/a
Meas. Tech.ChEMBL_210397 (CHEMBL814127)
IC50>10000±n/a nM
Citation Ksander, GMde Jesus, RYuan, AGhai, RDMcMartin, CBohacek, R Meta-substituted benzofused macrocyclic lactams as zinc metalloprotease inhibitors. J Med Chem40:506-14 (1997) 
 
Thermolysin
Name:Thermolysin
Type:PROTEIN
Mol. Mass.:60097.54
Organism:Bacillus thermoproteolyticus
Description:ChEMBL_1468794
Residue:548
BDBM50056258
NameBDBM50056258
Synonyms:(3R,6S)-3-Mercaptomethyl-4-oxo-5-aza-bicyclo[10.3.1]hexadeca-1(15),12(16),13-triene-6-carboxylic acid | CHEMBL148840
TypeSmall organic molecule
Emp. Form.C17H23NO3S
Mol. Mass.321.434
SMILESOC(=O)[C@@H]1CCCCCc2cccc(C[C@@H](CS)C(=O)N1)c2