Reaction Details
TargetNeprilysin
LigandBDBM50056262
Substrate/Competitorn/a
Meas. Tech.ChEMBL_144636 (CHEMBL752994)
IC50 8±n/a nM
Citation Ksander, GMde Jesus, RYuan, AGhai, RDMcMartin, CBohacek, R Meta-substituted benzofused macrocyclic lactams as zinc metalloprotease inhibitors. J Med Chem40:506-14 (1997) 
 
Neprilysin
Name:Neprilysin
Type:Enzyme
Mol. Mass.:85505.38
Organism:Homo sapiens (Human)
Description:P08473
Residue:750
BDBM50056262
NameBDBM50056262
Synonyms:(3S,6S)-3-Mercaptomethyl-4-oxo-5-aza-bicyclo[10.3.1]hexadeca-1(15),12(16),13-triene-6-carboxylic acid | CHEMBL147185
TypeSmall organic molecule
Emp. Form.C17H23NO3S
Mol. Mass.321.434
SMILESOC(=O)[C@@H]1CCCCCc2cccc(C[C@H](CS)C(=O)N1)c2