Reaction Details
TargetAngiotensin-converting enzyme
LigandBDBM50056249
Substrate/Competitorn/a
Meas. Tech.ChEMBL_35998 (CHEMBL644707)
IC50 8000±n/a nM
Citation Ksander, GMde Jesus, RYuan, AGhai, RDMcMartin, CBohacek, R Meta-substituted benzofused macrocyclic lactams as zinc metalloprotease inhibitors. J Med Chem40:506-14 (1997) 
 
Angiotensin-converting enzyme
Name:Angiotensin-converting enzyme
Type:Enzyme
Mol. Mass.:149709.01
Organism:Homo sapiens (Human)
Description:n/a
Residue:1306
BDBM50056249
NameBDBM50056249
Synonyms:(6S,9S)-6-Mercaptomethyl-7-oxo-5,6,7,8,9,10,11,12,13,14-decahydro-8-aza-benzocyclododecene-9-carboxylic acid | CHEMBL342091
TypeSmall organic molecule
Emp. Form.C17H23NO3S
Mol. Mass.321.434
SMILESOC(=O)[C@@H]1CCCCCc2ccccc2C[C@H](CS)C(=O)N1