Reaction Details
TargetAngiotensin-converting enzyme
LigandBDBM50056252
Substrate/Competitorn/a
Meas. Tech.ChEMBL_35998 (CHEMBL644707)
IC50>10000±n/a nM
Citation Ksander, GMde Jesus, RYuan, AGhai, RDMcMartin, CBohacek, R Meta-substituted benzofused macrocyclic lactams as zinc metalloprotease inhibitors. J Med Chem40:506-14 (1997) 
 
Angiotensin-converting enzyme
Name:Angiotensin-converting enzyme
Type:Enzyme
Mol. Mass.:149709.01
Organism:Homo sapiens (Human)
Description:n/a
Residue:1306
BDBM50056252
NameBDBM50056252
Synonyms:(6S,9S)-6-Mercaptomethyl-7-oxo-6,7,8,9,10,11,12,13-octahydro-5H-8-aza-benzocycloundecene-9-carboxylic acid | CHEMBL150222
TypeSmall organic molecule
Emp. Form.C16H21NO3S
Mol. Mass.307.408
SMILESOC(=O)[C@@H]1CCCCc2ccccc2C[C@H](CS)C(=O)N1