Reaction Details
TargetGlutamate receptor ionotropic, NMDA 1
LigandBDBM50038168
Substrate/Competitorn/a
Meas. Tech.ChEMBL_140848 (CHEMBL752332)
IC50 2±n/a nM
Citation Carling, RWLeeson, PDMoore, KWMoyes, CRDuncton, MHudson, MLBaker, RFoster, ACGrimwood, SKemp, JAMarshall, GRTricklebank, MDSaywell, KL 4-substituted-3-phenylquinolin-2(1H)-ones: acidic and nonacidic glycine site N-methyl-D-aspartate antagonists with in vivo activity. J Med Chem40:754-65 (1997) 
 
Glutamate receptor ionotropic, NMDA 1
Name:Glutamate receptor ionotropic, NMDA 1
Type:Enzyme Catalytic Domain
Mol. Mass.:105533.40
Organism:RAT
Description:P35439
Residue:938
BDBM50038168
NameBDBM50038168
Synonyms:7-Chloro-4-hydroxy-3-(3-phenoxy-phenyl)-1H-quinolin-2-one CHEMBL31741 | L-701324
TypeSmall organic molecule
Emp. Form.C21H14ClNO3
Mol. Mass.363.794
SMILESOc1c(-c2cccc(Oc3ccccc3)c2)c(=O)[nH]c2cc(Cl)ccc12