Reaction Details
TargetDelta-type opioid receptor
LigandBDBM50057011
Substrate/Competitorn/a
Meas. Tech.ChEMBL_147192 (CHEMBL759365)
Ki 0.153000±n/a nM
Citation Tóth, GDarula, ZPéter, AFülöp, FTourwé, DJaspers, HVerheyden, PBöcskey, ZTóth, ZBorsodi, A Conformationally constrained deltorphin analogs with 2-aminotetralin-2-carboxylic acid in position 3. J Med Chem40:990-5 (1997) 
 
Delta-type opioid receptor
Name:Delta-type opioid receptor
Type:G Protein-Coupled Receptor (GPCR)
Mol. Mass.:40465.04
Organism:Rattus norvegicus (rat)
Description:Competition binding assays were using CHO-K1 cell membranes expressing the opioid receptor.
Residue:372
BDBM50057011
NameBDBM50057011
Synonyms:(S)-3-[((R)-2-{(R)-2-[(S)-2-Amino-3-(4-hydroxy-phenyl)-propionylamino]-propionylamino}-1,2,3,4-tetrahydro-naphthalene-2-carbonyl)-amino]-N-{(1S,2S)-1-[(1S,2S)-1-(carbamoylmethyl-carbamoyl)-2-methyl-butylcarbamoyl]-2-methyl-butyl}-succinamic acid | CHEMBL433978
TypeSmall organic molecule
Emp. Form.C41H58N8O10
Mol. Mass.822.9468
SMILESCC[C@H](C)[C@H](NC(=O)[C@@H](NC(=O)[C@H](CC(O)=O)NC(=O)[C@]1(CCc2ccccc2C1)NC(=O)[C@@H](C)NC(=O)[C@@H](N)Cc1ccc(O)cc1)[C@@H](C)CC)C(=O)NCC(N)=O