Reaction Details
TargetDelta-type opioid receptor
LigandBDBM50057009
Substrate/Competitorn/a
Meas. Tech.ChEMBL_147193 (CHEMBL756869)
Ki 0.056000±n/a nM
Citation Tóth, GDarula, ZPéter, AFülöp, FTourwé, DJaspers, HVerheyden, PBöcskey, ZTóth, ZBorsodi, A Conformationally constrained deltorphin analogs with 2-aminotetralin-2-carboxylic acid in position 3. J Med Chem40:990-5 (1997) 
 
Delta-type opioid receptor
Name:Delta-type opioid receptor
Type:G Protein-Coupled Receptor (GPCR)
Mol. Mass.:40465.04
Organism:Rattus norvegicus (rat)
Description:Competition binding assays were using CHO-K1 cell membranes expressing the opioid receptor.
Residue:372
BDBM50057009
NameBDBM50057009
Synonyms:(S)-3-((S)-2-{(R)-2-[(S)-2-Amino-3-(4-hydroxy-phenyl)-propionylamino]-propionylamino}-3-phenyl-propionylamino)-N-{(1S,2S)-1-[(1S,2S)-1-(carbamoylmethyl-carbamoyl)-2-methyl-butylcarbamoyl]-2-methyl-butyl}-succinamic acid | CHEMBL175116
TypeSmall organic molecule
Emp. Form.C39H56N8O10
Mol. Mass.796.9095
SMILESCC[C@H](C)[C@H](NC(=O)[C@@H](NC(=O)[C@H](CC(O)=O)NC(=O)[C@H](Cc1ccccc1)NC(=O)[C@@H](C)NC(=O)[C@@H](N)Cc1ccc(O)cc1)[C@@H](C)CC)C(=O)NCC(N)=O