Reaction Details
Target72 kDa type IV collagenase
LigandBDBM50057064
Substrate/Competitorn/a
Meas. Tech.ChEMBL_104543 (CHEMBL718930)
Ki 50±n/a nM
Citation Esser, CKBugianesi, RLCaldwell, CGChapman, KTDurette, PLGirotra, NNKopka, IELanza, TJLevorse, DAMacCoss, MOwens, KAPonpipom, MMSimeone, JPHarrison, RKNiedzwiecki, LBecker, JWMarcy, AIAxel, MGChristen, AJMcDonnell, JMoore, VLOlszewski, JMSaphos, CVisco, DMHagmann, WK Inhibition of stromelysin-1 (MMP-3) by P1'-biphenylylethyl carboxyalkyl dipeptides. J Med Chem40:1026-40 (1997) 
 
72 kDa type IV collagenase
Name:72 kDa type IV collagenase
Type:Enzyme
Mol. Mass.:73870.36
Organism:Homo sapiens (Human)
Description: P08253
Residue:660
BDBM50057064
NameBDBM50057064
Synonyms:(2S,4R)-2-Butyl-6-(4'-dimethylcarbamoyl-biphenyl-4-yl)-4-((S)-2,2-dimethyl-1-methylcarbamoyl-propylcarbamoyl)-hexanoic acid | CHEMBL8868
TypeSmall organic molecule
Emp. Form.C33H47N3O5
Mol. Mass.565.7434
SMILESCCCC[C@@H](C[C@@H](CCc1ccc(cc1)-c1ccc(cc1)C(=O)N(C)C)C(=O)N[C@H](C(=O)NC)C(C)(C)C)C(O)=O