Reaction Details
TargetRibosomal protein S6 kinase alpha-3
LigandBDBM50505542
Substrate/Competitorn/a
Meas. Tech.ChEMBL_1823149 (CHEMBL4322913)
Kd 2.0±n/a nM
Citation Hirozane, YToyofuku, MYogo, TTanaka, YSameshima, TMiyahisa, IYoshikawa, M Structure-based rational design of staurosporine-based fluorescent probe with broad-ranging kinase affinity for kinase panel application. Bioorg Med Chem Lett29:0 (2019) 
 
Ribosomal protein S6 kinase alpha-3
Name:Ribosomal protein S6 kinase alpha-3
Type:Serine/threonine-protein kinase
Mol. Mass.:83740.03
Organism:Homo sapiens (Human)
Description:The human RSK2 sequence differed from the Genbank entry NM_004586 at one residue, V45G. The protein was cloned and purified from baculovirus expression system.
Residue:740
BDBM50505542
NameBDBM50505542
Synonyms:CHEMBL4576489
TypeSmall organic molecule
Emp. Form.C50H56BF2N7O7
Mol. Mass.915.83
SMILES[H][C@]12C[C@H]([C@@H](OC)[C@](C)(O1)n1c3ccccc3c3c4CNC(=O)c4c4c5ccccc5n2c4c13)N(C)CCOCCOCCOCCNC(=O)CCC1=[N+]2C(C=C1)=Cc1c(C)cc(C)n1[B-]2(F)F