Reaction Details
TargetHomeodomain-interacting protein kinase 2
LigandBDBM50505542
Substrate/Competitorn/a
Meas. Tech.ChEMBL_1823160 (CHEMBL4322924)
Kd 559±n/a nM
Citation Hirozane, YToyofuku, MYogo, TTanaka, YSameshima, TMiyahisa, IYoshikawa, M Structure-based rational design of staurosporine-based fluorescent probe with broad-ranging kinase affinity for kinase panel application. Bioorg Med Chem Lett29:0 (2019) 
 
Homeodomain-interacting protein kinase 2
Name:Homeodomain-interacting protein kinase 2
Type:Protein
Mol. Mass.:131001.90
Organism:Homo sapiens (Human)
Description:Q9H2X6
Residue:1198
BDBM50505542
NameBDBM50505542
Synonyms:CHEMBL4576489
TypeSmall organic molecule
Emp. Form.C50H56BF2N7O7
Mol. Mass.915.83
SMILES[H][C@]12C[C@H]([C@@H](OC)[C@](C)(O1)n1c3ccccc3c3c4CNC(=O)c4c4c5ccccc5n2c4c13)N(C)CCOCCOCCOCCNC(=O)CCC1=[N+]2C(C=C1)=Cc1c(C)cc(C)n1[B-]2(F)F