Reaction Details
TargetMitogen-activated protein kinase 8
LigandBDBM50505541
Substrate/Competitorn/a
Meas. Tech.ChEMBL_1822961 (CHEMBL4322725)
Kd 286±n/a nM
Citation Hirozane, YToyofuku, MYogo, TTanaka, YSameshima, TMiyahisa, IYoshikawa, M Structure-based rational design of staurosporine-based fluorescent probe with broad-ranging kinase affinity for kinase panel application. Bioorg Med Chem Lett29:0 (2019) 
 
Mitogen-activated protein kinase 8
Name:Mitogen-activated protein kinase 8
Type:Enzyme
Mol. Mass.:48297.57
Organism:Homo sapiens (Human)
Description:JNK-1 was purchased from Upstate Cell Signaling Solutions (formerly Upstate Biotechnology).
Residue:427
BDBM50505541
NameBDBM50505541
Synonyms:CHEMBL4465866
TypeSmall organic molecule
Emp. Form.C49H54BF2N7O7
Mol. Mass.901.804
SMILES[H][C@]12C[C@@H](NCCOCCOCCOCCNC(=O)CCC3=[N+]4C(C=C3)=Cc3c(C)cc(C)n3[B-]4(F)F)[C@@H](OC)[C@](C)(O1)n1c3ccccc3c3c4CNC(=O)c4c4c5ccccc5n2c4c13