Reaction Details
TargetKappa-type opioid receptor
LigandBDBM50057391
Substrate/Competitorn/a
Meas. Tech.ChEMBL_146384 (CHEMBL753180)
Ki 1.5±n/a nM
Citation Arttamangkul, SIshmael, JEMurray, TFGrandy, DKDeLander, GEKieffer, BLAldrich, JV Synthesis and opioid activity of conformationally constrained dynorphin A analogues. 2. Conformational constraint in the"address" sequence. J Med Chem40:1211-8 (1997) 
 
Kappa-type opioid receptor
Name:Kappa-type opioid receptor
Type:G Protein-Coupled Receptor (GPCR)
Mol. Mass.:42744.99
Organism:Cavia porcellus (domestic guinea pig)
Description:P41144
Residue:380
BDBM50057391
NameBDBM50057391
Synonyms:Analog of Dynorphin A | CHEMBL412413
TypeSmall organic molecule
Emp. Form.C72H115N19O16
Mol. Mass.1502.8012
SMILESCC[C@H](C)[C@H]1NC(=O)[C@H](CCCNC(N)=N)NC(=O)[C@H](CC(=O)N[C@@H](CCCNC1=O)C(=O)N1CCC[C@H]1C(=O)N[C@@H](CCCCN)C(=O)N[C@@H](CC(C)C)C(=O)N[C@@H](CCCCN)C(O)=O)NC(=O)[C@H](CC(C)C)NC(=O)[C@H](Cc1ccccc1)NC(=O)CNC(=O)CNC(=O)[C@@H](N)Cc1ccc(O)cc1