Reaction Details
TargetSolute carrier family 22 member 1
LigandBDBM50505665
Substrate/Competitorn/a
Meas. Tech.ChEMBL_1823590 (CHEMBL4323354)
IC50 10000±n/a nM
Citation Meyer, MJNeumann, VEFriesacher, HRZdrazil, BBrockmöller, JTzvetkov, MV Opioids as Substrates and Inhibitors of the Genetically Highly Variable Organic Cation Transporter OCT1. J Med Chem62:9890-9905 (2019) 
 
Solute carrier family 22 member 1
Name:Solute carrier family 22 member 1
Type:Enzyme Catalytic Domain
Mol. Mass.:61154.85
Organism:Homo sapiens (Human)
Description:Adrenergic Alpha 0 HUMAN::O15245
Residue:554
BDBM50505665
NameBDBM50505665
Synonyms:CHEMBL1623871
TypeSmall organic molecule
Emp. Form.C17H23NO
Mol. Mass.257.3706
SMILES[H][C@@]12Cc3ccc(OC)cc3[C@]3(CCCC[C@@]13[H])CCN2