Reaction Details
TargetSolute carrier family 22 member 1
LigandBDBM50386689
Substrate/Competitorn/a
Meas. Tech.ChEMBL_1823590 (CHEMBL4323354)
IC50 536960±n/a nM
Citation Meyer, MJNeumann, VEFriesacher, HRZdrazil, BBrockmöller, JTzvetkov, MV Opioids as Substrates and Inhibitors of the Genetically Highly Variable Organic Cation Transporter OCT1. J Med Chem62:9890-9905 (2019) 
 
Solute carrier family 22 member 1
Name:Solute carrier family 22 member 1
Type:Enzyme Catalytic Domain
Mol. Mass.:61154.85
Organism:Homo sapiens (Human)
Description:Adrenergic Alpha 0 HUMAN::O15245
Residue:554
BDBM50386689
NameBDBM50386689
Synonyms:Dihydrocodinone | HYDROCODONE
TypeSmall organic molecule
Emp. Form.C18H21NO3
Mol. Mass.299.3642
SMILESCOc1ccc2C[C@@H]3[C@@H]4CCC(=O)[C@@H]5Oc1c2[C@]45CCN3C