Reaction Details
TargetProtein kinase C alpha type
LigandBDBM50057513
Substrate/Competitorn/a
Meas. Tech.ChEMBL_160289 (CHEMBL769617)
Ki 334±n/a nM
Citation Kozikowski, APWang, SMa, DYao, JAhmad, SGlazer, RIBogi, KAcs, PModarres, SLewin, NEBlumberg, PM Modeling, chemistry, and biology of the benzolactam analogues of indolactam V (ILV). 2. Identification of the binding site of the benzolactams in the CRD2 activator-binding domain of PKCdelta and discovery of an ILV analogue of improved isozyme selectivity. J Med Chem40:1316-26 (1997) 
 
Protein kinase C alpha type
Name:Protein kinase C alpha type
Type:Enzyme
Mol. Mass.:76755.65
Organism:Homo sapiens (Human)
Description:The recombinant human PKC enzymes were produced using a baculovirus expression system in SF9 cells
Residue:672
BDBM50057513
NameBDBM50057513
Synonyms:(2S,5S)-5-Hydroxymethyl-2-isopropyl-1-methyl-1,4,5,6-tetrahydro-2H-benzo[e][1,4]diazocin-3-one benzolactam-V8
TypeSmall organic molecule
Emp. Form.C15H22N2O2
Mol. Mass.262.3474
SMILESCC(C)[C@@H]1N(C)c2ccccc2C[C@@H](CO)NC1=O