Reaction Details
TargetProtein kinase C delta type
LigandBDBM50057510
Substrate/Competitorn/a
Meas. Tech.ChEMBL_160789 (CHEMBL766600)
Ki 185±n/a nM
Citation Kozikowski, APWang, SMa, DYao, JAhmad, SGlazer, RIBogi, KAcs, PModarres, SLewin, NEBlumberg, PM Modeling, chemistry, and biology of the benzolactam analogues of indolactam V (ILV). 2. Identification of the binding site of the benzolactams in the CRD2 activator-binding domain of PKCdelta and discovery of an ILV analogue of improved isozyme selectivity. J Med Chem40:1316-26 (1997) 
 
Protein kinase C delta type
Name:Protein kinase C delta type
Type:Enzyme
Mol. Mass.:77516.79
Organism:Homo sapiens (Human)
Description:The recombinant human PKC enzymes were produced using a baculovirus expression system in SF9 cells
Residue:676
BDBM50057510
NameBDBM50057510
Synonyms:(2S,5S)-8-Decyl-5-hydroxymethyl-2-isopropyl-1-methyl-1,4,5,6-tetrahydro-2H-benzo[e][1,4]diazocin-3-one | CHEMBL28205
TypeSmall organic molecule
Emp. Form.C25H42N2O2
Mol. Mass.402.6132
SMILESCCCCCCCCCCc1ccc2N(C)[C@@H](C(C)C)C(=O)N[C@H](CO)Cc2c1