Reaction Details
TargetProtein kinase C delta type
LigandBDBM50057512
Substrate/Competitorn/a
Meas. Tech.ChEMBL_162089 (CHEMBL767782)
Ki 0.8±n/a nM
Citation Kozikowski, APWang, SMa, DYao, JAhmad, SGlazer, RIBogi, KAcs, PModarres, SLewin, NEBlumberg, PM Modeling, chemistry, and biology of the benzolactam analogues of indolactam V (ILV). 2. Identification of the binding site of the benzolactams in the CRD2 activator-binding domain of PKCdelta and discovery of an ILV analogue of improved isozyme selectivity. J Med Chem40:1316-26 (1997) 
 
Protein kinase C delta type
Name:Protein kinase C delta type
Type:Enzyme
Mol. Mass.:77516.79
Organism:Homo sapiens (Human)
Description:The recombinant human PKC enzymes were produced using a baculovirus expression system in SF9 cells
Residue:676
BDBM50057512
NameBDBM50057512
Synonyms:(1aR,1bS,4aR,7aS,7bS,8R,9R,9aS)-4a,7b-dihydroxy-3-(hydroxymethyl)-1,1,6,8-tetramethyl-5-oxo-1,1a,1b,4,4a,5,7a,7b,8,9-decahydro-9aH-cyclopropa[3,4]benzo[1,2-e]azulene-9,9a-diyl dibutanoate PDBu phorbol 12,13-dibutyrate
TypeSmall organic molecule
Emp. Form.C28H40O8
Mol. Mass.504.6124
SMILESCCCC(=O)O[C@@H]1[C@@H](C)[C@]2(O)[C@@H]3C=C(C)C(=O)[C@@]3(O)CC(CO)=C[C@H]2[C@@H]2C(C)(C)[C@]12OC(=O)CCC