Reaction Details
TargetProstaglandin G/H synthase 2
LigandBDBM50057943
Substrate/Competitorn/a
Meas. Tech.ChEMBL_159742 (CHEMBL762906)
IC50 3±n/a nM
Citation Khanna, IKWeier, RMYu, YXu, XDKoszyk, FJCollins, PWKoboldt, CMVeenhuizen, AWPerkins, WECasler, JJMasferrer, JLZhang, YYGregory, SASeibert, KIsakson, PC 1,2-Diarylimidazoles as potent, cyclooxygenase-2 selective, and orally active antiinflammatory agents. J Med Chem40:1634-47 (1997) 
 
Prostaglandin G/H synthase 2
Name:Prostaglandin G/H synthase 2
Type:Enzyme
Mol. Mass.:69003.89
Organism:Homo sapiens (Human)
Description:Recombinant Cox-2 provided by Cayman (Cayman Chemical Co.,Ann Arbor, MI).
Residue:604
BDBM50057943
NameBDBM50057943
Synonyms:4-[2-(3-Chloro-4-methyl-phenyl)-4-trifluoromethyl-imidazol-1-yl]-benzenesulfonamide | CHEMBL298476
TypeSmall organic molecule
Emp. Form.C17H13ClF3N3O2S
Mol. Mass.415.817
SMILESCc1ccc(cc1Cl)-c1nc(cn1-c1ccc(cc1)S(N)(=O)=O)C(F)(F)F