Reaction Details
TargetC-C chemokine receptor type 5
LigandBDBM50506122
Substrate/Competitorn/a
Meas. Tech.ChEMBL_1824974 (CHEMBL4324738)
EC50 9.0±n/a nM
Citation Ortiz Zacarķas, NVvan Veldhoven, JPDden Hollander, LSDogan, BOpeny, JHsiao, YYLenselink, EBHeitman, LHIJzerman, AP Synthesis and Pharmacological Evaluation of Triazolopyrimidinone Derivatives as Noncompetitive, Intracellular Antagonists for CC Chemokine Receptors 2 and 5. J Med Chem62:11035-11053 (2019) 
 
C-C chemokine receptor type 5
Name:C-C chemokine receptor type 5
Type:Enzyme
Mol. Mass.:40540.21
Organism:Homo sapiens (Human)
Description:P51681
Residue:352
BDBM50506122
NameBDBM50506122
Synonyms:CHEMBL4531005
TypeSmall organic molecule
Emp. Form.C15H15Cl2N5O
Mol. Mass.352.219
SMILESCC(C)c1[nH]c2nc(N)nn2c(=O)c1Cc1cccc(Cl)c1Cl