Reaction Details
TargetC-C chemokine receptor type 2
LigandBDBM50506124
Substrate/Competitorn/a
Meas. Tech.ChEMBL_1824971 (CHEMBL4324735)
EC50 32±n/a nM
Citation Ortiz Zacarķas, NVvan Veldhoven, JPDden Hollander, LSDogan, BOpeny, JHsiao, YYLenselink, EBHeitman, LHIJzerman, AP Synthesis and Pharmacological Evaluation of Triazolopyrimidinone Derivatives as Noncompetitive, Intracellular Antagonists for CC Chemokine Receptors 2 and 5. J Med Chem62:11035-11053 (2019) 
 
C-C chemokine receptor type 2
Name:C-C chemokine receptor type 2
Type:Enzyme
Mol. Mass.:41932.32
Organism:Homo sapiens (Human)
Description:P41597
Residue:374
BDBM50506124
NameBDBM50506124
Synonyms:CHEMBL4544504
TypeSmall organic molecule
Emp. Form.C15H15BrClN5O
Mol. Mass.396.67
SMILESCC(C)c1[nH]c2nc(N)nn2c(=O)c1Cc1ccc(Cl)c(Br)c1