Reaction Details
Target5-hydroxytryptamine receptor 4
LigandBDBM50058170
Substrate/Competitorn/a
Meas. Tech.ChEMBL_3347 (CHEMBL619047)
Ki 1.05±n/a nM
Citation Soulier, JLYang, DBrémont, BCroci, TGuzzi, ULanglois, M Arylcarbamate derivatives of 1-piperidineethanol as potent ligands for 5-HT4 receptors. J Med Chem40:1755-61 (1997) 
 
5-hydroxytryptamine receptor 4
Name:5-hydroxytryptamine receptor 4
Type:Enzyme Catalytic Domain
Mol. Mass.:46117.31
Organism:RAT
Description:5-HT4 HTR4 RAT::Q62758
Residue:406
BDBM50058170
NameBDBM50058170
Synonyms:(2-Ethoxy-phenyl)-carbamic acid 2-((3R,5S)-3,5-dimethyl-piperidin-1-yl)-ethyl ester CHEMBL48836
TypeSmall organic molecule
Emp. Form.C18H28N2O3
Mol. Mass.320.4265
SMILESCCOc1ccccc1NC(=O)OCCN1C[C@@H](C)C[C@@H](C)C1