Reaction Details
TargetD(4) dopamine receptor
LigandBDBM50058227
Substrate/Competitorn/a
Meas. Tech.ChEMBL_60667 (CHEMBL671703)
Ki 32±n/a nM
Citation Glase, SAAkunne, HCGeorgic, LMHeffner, TGMacKenzie, RGManley, PJPugsley, TAWise, LD Substituted [(4-phenylpiperazinyl)-methyl]benzamides: selective dopamine D4 agonists. J Med Chem40:1771-2 (1997) 
 
D(4) dopamine receptor
Name:D(4) dopamine receptor
Type:Enzyme
Mol. Mass.:48373.19
Organism:Homo sapiens (Human)
Description:P21917
Residue:419
BDBM50058227
NameBDBM50058227
Synonyms:CHEMBL298763 | N-[4-(2-Chloro-phenyl)-piperazin-1-ylmethyl]-benzamide
TypeSmall organic molecule
Emp. Form.C18H20ClN3O
Mol. Mass.329.824
SMILESClc1ccccc1N1CCN(CNC(=O)c2ccccc2)CC1