Reaction Details
TargetD(4) dopamine receptor
LigandBDBM50058226
Substrate/Competitorn/a
Meas. Tech.ChEMBL_60667 (CHEMBL671703)
Ki 34±n/a nM
Citation Glase, SAAkunne, HCGeorgic, LMHeffner, TGMacKenzie, RGManley, PJPugsley, TAWise, LD Substituted [(4-phenylpiperazinyl)-methyl]benzamides: selective dopamine D4 agonists. J Med Chem40:1771-2 (1997) 
 
D(4) dopamine receptor
Name:D(4) dopamine receptor
Type:Enzyme
Mol. Mass.:48373.19
Organism:Homo sapiens (Human)
Description:P21917
Residue:419
BDBM50058226
NameBDBM50058226
Synonyms:3-Chloro-N-[4-(2-cyano-phenyl)-piperazin-1-ylmethyl]-benzamide | CHEMBL49502
TypeSmall organic molecule
Emp. Form.C19H19ClN4O
Mol. Mass.354.833
SMILESClc1cccc(c1)C(=O)NCN1CCN(CC1)c1ccccc1C#N