Reaction Details
TargetD(4) dopamine receptor
LigandBDBM50058222
Substrate/Competitorn/a
Meas. Tech.ChEMBL_63075 (CHEMBL673642)
EC50 3.4±n/a nM
Citation Glase, SAAkunne, HCGeorgic, LMHeffner, TGMacKenzie, RGManley, PJPugsley, TAWise, LD Substituted [(4-phenylpiperazinyl)-methyl]benzamides: selective dopamine D4 agonists. J Med Chem40:1771-2 (1997) 
 
D(4) dopamine receptor
Name:D(4) dopamine receptor
Type:Enzyme
Mol. Mass.:48373.19
Organism:Homo sapiens (Human)
Description:P21917
Residue:419
BDBM50058222
NameBDBM50058222
Synonyms:CHEMBL51023 | N-[4-(2-Methoxy-phenyl)-piperazin-1-ylmethyl]-4-methyl-benzamide
TypeSmall organic molecule
Emp. Form.C20H25N3O2
Mol. Mass.339.4314
SMILESCOc1ccccc1N1CCN(CNC(=O)c2ccc(C)cc2)CC1