Reaction Details
TargetAdenosine receptor A1
LigandBDBM50058235
Substrate/Competitorn/a
Meas. Tech.ChEMBL_29297 (CHEMBL640358)
Ki 2.56±n/a nM
Citation Pfister, JRBelardinelli, LLee, GLum, RTMilner, PStanley, WCLinden, JBaker, SPSchreiner, G Synthesis and biological evaluation of the enantiomers of the potent and selective A1-adenosine antagonist 1,3-dipropyl-8-[2-(5,6-epoxynorbonyl)]-xanthine. J Med Chem40:1773-8 (1997) 
 
Adenosine receptor A1
Name:Adenosine receptor A1
Type:Enzyme Catalytic Domain
Mol. Mass.:36501.39
Organism:GUINEA PIG
Description:ADENOSINE A1 ADORA1 GUINEA PIG::P47745
Residue:326
BDBM50058235
NameBDBM50058235
Synonyms:8-(3-Oxa-tricyclo[3.2.1.0*2,4*]oct-6-yl)-1,3-dipropyl-3,7-dihydro-purine-2,6-dione | CHEMBL298474
TypeSmall organic molecule
Emp. Form.C18H24N4O3
Mol. Mass.344.4082
SMILESCCCn1c2nc([nH]c2c(=O)n(CCC)c1=O)C1CC2CC1C1OC21