Reaction Details
TargetDihydrofolate reductase
LigandBDBM18512
Substrate/Competitorn/a
Meas. Tech.ChEMBL_54960 (CHEMBL669620)
IC50 2300±n/a nM
Citation Stevens, MFPhillip, KSRathbone, DLO'Shea, DMQueener, SFSchwalbe, CHLambert, PA Structural studies on bioactive compounds. 28. Selective activity of triazenyl-substituted pyrimethamine derivatives against Pneumocystis carinii dihydrofolate reductase. J Med Chem40:1886-93 (1997) 
 
Dihydrofolate reductase
Name:Dihydrofolate reductase
Type:Enzyme
Mol. Mass.:21638.84
Organism:Rattus norvegicus (rat)
Description:n/a
Residue:187
BDBM18512
NameBDBM18512
Synonyms:5-(4-chlorophenyl)-6-ethylpyrimidine-2,4-diamine Pyrimethamine (Pyr) cid_4993
TypeSmall organic molecule
Emp. Form.C12H13ClN4
Mol. Mass.248.711
SMILESCCc1nc(N)nc(N)c1-c1ccc(Cl)cc1