Reaction Details
TargetCatechol O-methyltransferase
LigandBDBM50058811
Substrate/Competitorn/a
Meas. Tech.ChEMBL_47242 (CHEMBL656649)
Ki 35000±n/a nM
Citation Brevitt, SETan, EW Synthesis and in vitro evaluation of two progressive series of bifunctional polyhydroxybenzamide catechol-O-methyltransferase inhibitors. J Med Chem40:2035-9 (1997) 
 
Catechol O-methyltransferase
Name:Catechol O-methyltransferase
Type:PROTEIN
Mol. Mass.:20586.58
Organism:Sus scrofa
Description:ChEMBL_105412
Residue:186
BDBM50058811
NameBDBM50058811
Synonyms:CHEMBL60350 | N,N'-1,6-Hexanediylbis(3,4,5-trihydroxybenzamide)Hydrate
TypeSmall organic molecule
Emp. Form.C20H24N2O8
Mol. Mass.420.4132
SMILESOc1cc(cc(O)c1O)C(=O)NCCCCCCNC(=O)c1cc(O)c(O)c(O)c1