Reaction Details
TargetCatechol O-methyltransferase
LigandBDBM50058813
Substrate/Competitorn/a
Meas. Tech.ChEMBL_47241 (CHEMBL656648)
Ki 500±n/a nM
Citation Brevitt, SETan, EW Synthesis and in vitro evaluation of two progressive series of bifunctional polyhydroxybenzamide catechol-O-methyltransferase inhibitors. J Med Chem40:2035-9 (1997) 
 
Catechol O-methyltransferase
Name:Catechol O-methyltransferase
Type:PROTEIN
Mol. Mass.:20586.58
Organism:Sus scrofa
Description:ChEMBL_105412
Residue:186
BDBM50058813
NameBDBM50058813
Synonyms:3,4,5-Trihydroxy-N-propyl-benzamide | CHEMBL64275
TypeSmall organic molecule
Emp. Form.C10H13NO4
Mol. Mass.211.2145
SMILESCCCNC(=O)c1cc(O)c(O)c(O)c1