Reaction Details
TargetCatechol O-methyltransferase
LigandBDBM50058812
Substrate/Competitorn/a
Meas. Tech.ChEMBL_47242 (CHEMBL656649)
Ki 6600±n/a nM
Citation Brevitt, SETan, EW Synthesis and in vitro evaluation of two progressive series of bifunctional polyhydroxybenzamide catechol-O-methyltransferase inhibitors. J Med Chem40:2035-9 (1997) 
 
Catechol O-methyltransferase
Name:Catechol O-methyltransferase
Type:PROTEIN
Mol. Mass.:20586.58
Organism:Sus scrofa
Description:ChEMBL_105412
Residue:186
BDBM50058812
NameBDBM50058812
Synonyms:CHEMBL302625 US9120744, CDE-070
TypeSmall organic molecule
Emp. Form.C17H18N2O8
Mol. Mass.378.3334
SMILESOc1cc(cc(O)c1O)C(=O)NCCCNC(=O)c1cc(O)c(O)c(O)c1