Reaction Details
TargetMitogen-activated protein kinase 10
LigandBDBM50506718
Substrate/Competitorn/a
Meas. Tech.ChEMBL_1827111 (CHEMBL4326985)
Kd 275±n/a nM
Citation Schepetkin, IAKhlebnikov, AIPotapov, ASKovrizhina, ARMatveevskaya, VVBelyanin, MLAtochin, DNZanoza, SOGaidarzhy, NMLyakhov, SAKirpotina, LNQuinn, MT Synthesis, biological evaluation, and molecular modeling of 11H-indeno[1,2-b]quinoxalin-11-one derivatives and tryptanthrin-6-oxime as c-Jun N-terminal kinase inhibitors. Eur J Med Chem161:179-191 (2019) 
 
Mitogen-activated protein kinase 10
Name:Mitogen-activated protein kinase 10
Type:Enzyme
Mol. Mass.:52586.89
Organism:Homo sapiens (Human)
Description:n/a
Residue:464
BDBM50506718
NameBDBM50506718
Synonyms:CHEMBL1098827
TypeSmall organic molecule
Emp. Form.C15H9N3O2
Mol. Mass.263.2509
SMILESO\N=C1/c2ccccc2-n2c1nc1ccccc1c2=O