Reaction Details
TargetMitogen-activated protein kinase 8
LigandBDBM50506716
Substrate/Competitorn/a
Meas. Tech.ChEMBL_1827109 (CHEMBL4326983)
Kd 580±n/a nM
Citation Schepetkin, IAKhlebnikov, AIPotapov, ASKovrizhina, ARMatveevskaya, VVBelyanin, MLAtochin, DNZanoza, SOGaidarzhy, NMLyakhov, SAKirpotina, LNQuinn, MT Synthesis, biological evaluation, and molecular modeling of 11H-indeno[1,2-b]quinoxalin-11-one derivatives and tryptanthrin-6-oxime as c-Jun N-terminal kinase inhibitors. Eur J Med Chem161:179-191 (2019) 
 
Mitogen-activated protein kinase 8
Name:Mitogen-activated protein kinase 8
Type:Enzyme
Mol. Mass.:48297.57
Organism:Homo sapiens (Human)
Description:JNK-1 was purchased from Upstate Cell Signaling Solutions (formerly Upstate Biotechnology).
Residue:427
BDBM50506716
NameBDBM50506716
Synonyms:CHEMBL4521282
TypeSmall organic molecule
Emp. Form.C16H11N3O
Mol. Mass.261.278
SMILESCc1ccc2nc3\C(=N/O)c4ccccc4-c3nc2c1