Reaction Details
TargetMitogen-activated protein kinase 10
LigandBDBM16018
Substrate/Competitorn/a
Meas. Tech.ChEMBL_1827111 (CHEMBL4326985)
Kd 22±n/a nM
Citation Schepetkin, IAKhlebnikov, AIPotapov, ASKovrizhina, ARMatveevskaya, VVBelyanin, MLAtochin, DNZanoza, SOGaidarzhy, NMLyakhov, SAKirpotina, LNQuinn, MT Synthesis, biological evaluation, and molecular modeling of 11H-indeno[1,2-b]quinoxalin-11-one derivatives and tryptanthrin-6-oxime as c-Jun N-terminal kinase inhibitors. Eur J Med Chem161:179-191 (2019) 
 
Mitogen-activated protein kinase 10
Name:Mitogen-activated protein kinase 10
Type:Enzyme
Mol. Mass.:52586.89
Organism:Homo sapiens (Human)
Description:n/a
Residue:464
BDBM16018
NameBDBM16018
Synonyms:14,15-diazatetracyclo[7.6.1.0^{2,7}.0^{13,16}]hexadeca-1(15),2(7),3,5,9(16),10,12-heptaen-8-one ChemBiol10705 Compound 4 SP 600125 SP600125 dibenzo[cd,g]indazol-6(2H)-one
TypeSmall organic molecule
Emp. Form.C14H8N2O
Mol. Mass.220.2261
SMILESO=C1c2ccccc2-c2n[nH]c3cccc1c23