Reaction Details
TargetIntegrin alpha-V/beta-3
LigandBDBM50059136
Substrate/Competitorn/a
Meas. Tech.ChEMBL_214773 (CHEMBL816231)
Ki 15±n/a nM
Citation Keenan, RMMiller, WHKwon, CAli, FECallahan, JFCalvo, RRHwang, SMKopple, KDPeishoff, CESamanen, JMWong, ASYuan, CKHuffman, WF Discovery of potent nonpeptide vitronectin receptor (alpha v beta 3) antagonists. J Med Chem40:2289-92 (1997) 
 
Integrin alpha-V/beta-3
Name:Integrin alpha-V/beta-3
Type:Enzyme
Mol. Mass.:n/a
Description:n/a
Components:This complex has 2 components.
Component 1
Name:Integrin alpha-V
Synonyms:ITAV_HUMAN Integrin alpha-V/alpha-5 VNRA Vitronectin receptor | Vitronectin receptor subunit alpha
Type:PROTEIN
Mol. Mass.:116024.92
Organism:Homo sapiens (Human)
Description:ChEMBL_582336
Residue:1048
Component 2
Name:Integrin beta-3
Synonyms:CD_antigen=CD61 GPIIIa ITGB3 Platelet membrane glycoprotein IIIa
Type:Protein
Mol. Mass.:87038.91
Organism:Homo sapiens (Human)
Description:P05106
Residue:788
BDBM50059136
NameBDBM50059136
Synonyms:CHEMBL73078 | {(S)-7-[(1H-Benzoimidazol-2-ylmethyl)-carbamoyl]-4-methyl-3-oxo-2,3,4,5-tetrahydro-1H-benzo[e][1,4]diazepin-2-yl}-acetic acid
TypeSmall organic molecule
Emp. Form.C21H21N5O4
Mol. Mass.407.4225
SMILESCN1Cc2cc(ccc2N[C@@H](CC(O)=O)C1=O)C(=O)NCc1nc2ccccc2[nH]1