Reaction Details
TargetIntegrin alpha-IIb/beta-3
LigandBDBM50059136
Substrate/Competitorn/a
Meas. Tech.ChEMBL_70322 (CHEMBL677002)
Ki 52000±n/a nM
Citation Keenan, RMMiller, WHKwon, CAli, FECallahan, JFCalvo, RRHwang, SMKopple, KDPeishoff, CESamanen, JMWong, ASYuan, CKHuffman, WF Discovery of potent nonpeptide vitronectin receptor (alpha v beta 3) antagonists. J Med Chem40:2289-92 (1997) 
 
Integrin alpha-IIb/beta-3
Name:Integrin alpha-IIb/beta-3
Synonyms:Glycoprotein IIb/IIIa
Type:n/a
Mol. Mass.:n/a
Description:ASSAY_ID of EBI is 30109
Components:This complex has 2 components.
Component 1
Name:Integrin beta-3
Type:Protein
Mol. Mass.:87038.91
Organism:Homo sapiens (Human)
Description:P05106
Residue:788
Component 2
Name:Integrin alpha-IIb
Synonyms:CD_antigen=CD41 GPIIb Glycoprotein IIb ITGA2B Integrin alpha-IIb heavy chain Integrin alpha-IIb light chain, form 2 Integrin alpha-V/beta-3 and alpha-IIb/beta 3 | Platelet membrane glycoprotein IIb
Type:Protein
Mol. Mass.:113354.85
Organism:Homo sapiens (Human)
Description:P08514
Residue:1039
BDBM50059136
NameBDBM50059136
Synonyms:CHEMBL73078 | {(S)-7-[(1H-Benzoimidazol-2-ylmethyl)-carbamoyl]-4-methyl-3-oxo-2,3,4,5-tetrahydro-1H-benzo[e][1,4]diazepin-2-yl}-acetic acid
TypeSmall organic molecule
Emp. Form.C21H21N5O4
Mol. Mass.407.4225
SMILESCN1Cc2cc(ccc2N[C@@H](CC(O)=O)C1=O)C(=O)NCc1nc2ccccc2[nH]1