Reaction Details
TargetD(4) dopamine receptor
LigandBDBM50050474
Substrate/Competitorn/a
Meas. Tech.ChEMBL_60829 (CHEMBL675818)
Ki 1.2±n/a nM
Citation Rowley, MCollins, IBroughton, HBDavey, WBBaker, REmms, FMarwood, RPatel, SPatel, SRagan, CIFreedman, SBBall, RLeeson, PD 4-Heterocyclylpiperidines as selective high-affinity ligands at the human dopamine D4 receptor. J Med Chem40:2374-85 (1997) 
 
D(4) dopamine receptor
Name:D(4) dopamine receptor
Type:Enzyme
Mol. Mass.:48373.19
Organism:Homo sapiens (Human)
Description:P21917
Residue:419
BDBM50050474
NameBDBM50050474
Synonyms:4-[5-(4-Chloro-phenyl)-4-methyl-1H-pyrazol-3-yl]-1-phenethyl-piperidine | CHEMBL61079
TypeSmall organic molecule
Emp. Form.C23H26ClN3
Mol. Mass.379.926
SMILESCc1c([nH]nc1-c1ccc(Cl)cc1)C1CCN(CCc2ccccc2)CC1